BDBM141314 US8653257, 2-Chloro-11-piperazin-1-yl-dibenzo[b,f][1,4]thiazepine
SMILES Clc1ccc2Sc3ccccc3N=C(N3CCNCC3)c2c1
InChI Key InChIKey=NYXDYIWPZMXTPA-UHFFFAOYSA-N
Data  1 KI
  Tab Delimited (TSV)   2D SDfile   Computed 3D by Vconf -m prep SDfile
Find this compound or compounds like it in BindingDB:
Activity Spreadsheet -- Enzyme Inhibition Constant Data from BindingDB
Found 1 hit for monomerid = 141314
TargetD(2) dopamine receptor(Homo sapiens (Human))
Astrazeneca
US Patent
LigandPNGBDBM141314(US8653257, 2-Chloro-11-piperazin-1-yl-dibenzo[b,f]...)
Affinity DataKi:  0.700nM. Assay description: The ability of test compounds to displace 3H-raclopride at the D2s receptor can be determined on membranes from D2s-transfected CHO cells (Bmax 13 pm...
In DepthDetails US Patent